BDBM50001216 3-{2-[2-Amino-3-(1H-imidazol-4-yl)-propionylamino]-4-methyl-pentanoylamino}-N-(1-{1-[1-carboxy-2-(1H-indol-3-yl)-ethylcarbamoyl]-2-methyl-butylcarbamoyl}-2-methyl-butyl)-succinamic acid::CHEMBL34540
SMILES CC[C@H](C)[C@H](NC(=O)[C@@H](NC(=O)[C@H](CC(O)=O)NC(=O)[C@H](CC(C)C)NC(=O)[C@@H](N)Cc1c[nH]cn1)[C@@H](C)CC)C(=O)N[C@@H](Cc1c[nH]c2ccccc12)C(O)=O
InChI Key InChIKey=NTSBFTNRWQVBCA-IVGDYKFASA-N
Data  2 IC50
  Tab Delimited (TSV)   2D SDfile   Computed 3D by Vconf -m prep SDfile
Find this compound or compounds like it in BindingDB:
Activity Spreadsheet -- Enzyme Inhibition Constant Data from BindingDB
Found 2 hits for monomerid = 50001216
TargetEndothelin receptor type B(RAT)
Warner-Lambert
Curated by ChEMBL
LigandPNGBDBM50001216(3-{2-[2-Amino-3-(1H-imidazol-4-yl)-propionylamino]...)
Affinity DataIC50: >5.00E+4nM. Assay description: Inhibition of ET-1 binding to Endothelin B receptor in cultured rat cerebellar membranes
In DepthDetails ArticlePubMed
TargetEndothelin-1 receptor(Homo sapiens (Human))
Warner-Lambert
Curated by ChEMBL
LigandPNGBDBM50001216(3-{2-[2-Amino-3-(1H-imidazol-4-yl)-propionylamino]...)
Affinity DataIC50: >5.00E+4nM. Assay description: Inhibition of ET-1 binding to Endothelin A receptor in cultured rabbit renal artery vascular smooth muscle cells
In DepthDetails ArticlePubMed