BDBM50001228 8-Methoxy-4-o-tolylamino-quinoline-3-carboxylic acid butylamide(0.2H2O)::CHEMBL114106
SMILES CCCCNC(=O)c1cnc2c(OC)cccc2c1Nc1ccccc1C
InChI Key InChIKey=CEMOHMULNHSZDS-UHFFFAOYSA-N
Data  1 IC50
  Tab Delimited (TSV)   2D SDfile   Computed 3D by Vconf -m prep SDfile
Find this compound or compounds like it in BindingDB:
Activity Spreadsheet -- Enzyme Inhibition Constant Data from BindingDB
Found 1 hit for monomerid = 50001228
TargetPotassium-transporting ATPase alpha chain 1/subunit beta(Sus scrofa (Pig))
Smithkline Beecham Pharmaceuticals R&D
Curated by ChEMBL
LigandPNGBDBM50001228(8-Methoxy-4-o-tolylamino-quinoline-3-carboxylic ac...)
Affinity DataIC50:  6.50E+4nM. Assay description: Inhibition of Shh signaling in mouse Shh-light2 cells by Gli-dependent firefly luciferase reporter gene assay
In DepthDetails ArticlePubMed