BDBM50001238 (3-Bromo-quinolin-4-yl)-o-tolyl-amine::CHEMBL115233
SMILES Cc1ccccc1Nc1c(Br)cnc2ccccc12
InChI Key InChIKey=VFJKWZNWBJQBKP-UHFFFAOYSA-N
Data  1 IC50
  Tab Delimited (TSV)   2D SDfile   Computed 3D by Vconf -m prep SDfile
Find this compound or compounds like it in BindingDB:
Activity Spreadsheet -- Enzyme Inhibition Constant Data from BindingDB
Found 1 hit for monomerid = 50001238
TargetPotassium-transporting ATPase alpha chain 1/subunit beta(Sus scrofa (Pig))
Smithkline Beecham Pharmaceuticals R&D
Curated by ChEMBL
LigandPNGBDBM50001238((3-Bromo-quinolin-4-yl)-o-tolyl-amine | CHEMBL1152...)
Affinity DataIC50:  1.41E+4nM. Assay description: Concentration required to inhibit the activity of K+ stimulated gastric ATPase
In DepthDetails ArticlePubMed