BDBM50001239 CHEMBL116272::Cyclobutyl-(8-methoxy-4-o-tolylamino-quinolin-3-yl)-methanone
SMILES COc1cccc2c(Nc3ccccc3C)c(cnc12)C(=O)C1CCC1
InChI Key InChIKey=ZNTDOPFZLXOXLH-UHFFFAOYSA-N
Data  1 IC50
  Tab Delimited (TSV)   2D SDfile   Computed 3D by Vconf -m prep SDfile
Find this compound or compounds like it in BindingDB:
Activity Spreadsheet -- Enzyme Inhibition Constant Data from BindingDB
Found 1 hit for monomerid = 50001239
TargetPotassium-transporting ATPase alpha chain 1/subunit beta(Sus scrofa (Pig))
Smithkline Beecham Pharmaceuticals R&D
Curated by ChEMBL
LigandPNGBDBM50001239(CHEMBL116272 | Cyclobutyl-(8-methoxy-4-o-tolylamin...)
Affinity DataIC50:  1.20E+3nM. Assay description: Concentration required to inhibit the activity of K+ stimulated gastric ATPase
In DepthDetails ArticlePubMed