BDBM50001242 8-Methoxy-4-o-tolylamino-quinoline-3-carboxylic acid methylamide::CHEMBL324952
SMILES CNC(=O)c1cnc2c(OC)cccc2c1Nc1ccccc1C
InChI Key InChIKey=FNOKPRGOENUGLY-UHFFFAOYSA-N
Data  1 IC50
  Tab Delimited (TSV)   2D SDfile   Computed 3D by Vconf -m prep SDfile
Find this compound or compounds like it in BindingDB:
Activity Spreadsheet -- Enzyme Inhibition Constant Data from BindingDB
Found 1 hit for monomerid = 50001242
TargetPotassium-transporting ATPase alpha chain 1/subunit beta(Sus scrofa (Pig))
Smithkline Beecham Pharmaceuticals R&D
Curated by ChEMBL
LigandPNGBDBM50001242(8-Methoxy-4-o-tolylamino-quinoline-3-carboxylic ac...)
Affinity DataIC50:  6.73E+3nM. Assay description: Concentration required to inhibit the activity of gastric H+/K+ ATPase
In DepthDetails ArticlePubMed