BDBM50001269 3-((2-Carboxy-ethylsulfanyl)-{3-[2-(7-chloro-quinolin-2-yl)-ethyl]-phenyl}-methylsulfanyl)-propionic acid::CHEMBL123623
SMILES OC(=O)CCSC(SCCC(O)=O)c1cccc(CCc2ccc3ccc(Cl)cc3n2)c1
InChI Key InChIKey=MFGAWIWWYAHFFG-UHFFFAOYSA-N
Data  1 IC50
  Tab Delimited (TSV)   2D SDfile   Computed 3D by Vconf -m prep SDfile
Find this compound or compounds like it in BindingDB:
Activity Spreadsheet -- Enzyme Inhibition Constant Data from BindingDB
Found 1 hit for monomerid = 50001269
TargetCysteinyl leukotriene receptor 1(GUINEA PIG)
Merck Frosst Centre For Therapeutic Research
Curated by ChEMBL
LigandPNGBDBM50001269(3-((2-Carboxy-ethylsulfanyl)-{3-[2-(7-chloro-quino...)
Affinity DataIC50:  57nM. Assay description: In vitro inhibition of [3H]LTD4 binding to guinea pig lung membranes
In DepthDetails ArticlePubMed