BDBM50001300 3-((2-Carboxy-ethylsulfanyl)-{3-[3-(7-chloro-quinolin-2-yl)-propyl]-phenyl}-methylsulfanyl)-propionic sodium salt::CHEMBL339713
SMILES [O-]C(=O)CCSC(SCCC([O-])=O)c1cccc(CCCc2ccc3ccc(Cl)cc3n2)c1
InChI Key InChIKey=WJJUYIKYSQYJIN-UHFFFAOYSA-L
Data  1 IC50
  Tab Delimited (TSV)   2D SDfile   Computed 3D by Vconf -m prep SDfile
Find this compound or compounds like it in BindingDB:
Activity Spreadsheet -- Enzyme Inhibition Constant Data from BindingDB
Found 1 hit for monomerid = 50001300
TargetCysteinyl leukotriene receptor 1(GUINEA PIG)
Merck Frosst Centre For Therapeutic Research
Curated by ChEMBL
LigandPNGBDBM50001300(3-((2-Carboxy-ethylsulfanyl)-{3-[3-(7-chloro-quino...)
Affinity DataIC50:  250nM. Assay description: In vitro inhibition of [3H]LTD4 binding to guinea pig lung membranes
In DepthDetails ArticlePubMed