BDBM50001305 15,23-dibenzyl-24-methyl-12-[1-methyl-(1S)-propyl]-(6aR,12S,15R,17aS,23R,25aS)-perhydropyrido[1,2-d]dipyrrolo[1,2-a:1,2-j][1,4,7,10,13,16]hexaazacyclooctadecine-6,11,14,17,22,25-hexaone::CHEMBL127056
SMILES CC[C@H](C)[C@@H]1NC(=O)[C@@H](Cc2ccccc2)NC(=O)[C@@H]2CCCN2C(=O)[C@@H](Cc2ccccc2)N(C)C(=O)[C@@H]2CCCCN2C(=O)[C@H]2CCCN2C1=O
InChI Key InChIKey=JDHZLXUKZZJJGJ-UBALQFROSA-N
Data  1 IC50
  Tab Delimited (TSV)   2D SDfile   Computed 3D by Vconf -m prep SDfile
Find this compound or compounds like it in BindingDB:
Activity Spreadsheet -- Enzyme Inhibition Constant Data from BindingDB
Found 1 hit for monomerid = 50001305
TargetOxytocin receptor(RAT)
Merck Research Laboratories
Curated by ChEMBL
LigandPNGBDBM50001305(15,23-dibenzyl-24-methyl-12-[1-methyl-(1S)-propyl]...)
Affinity DataIC50:  540nM. Assay description: Concentration required to displace 50% of [3H]oxytocin from rat uterine receptor.
In DepthDetails ArticlePubMed