BDBM50001376 1-[4,7-dimethylspiro[1H-indene-1,4'-(hexahydropyridine)]-1-ylsulfonylmethyl]-7,7-dimethyl-(1S,4R)-bicyclo[2.2.1]heptan-2-one::CHEMBL129581
SMILES Cc1cccc2c1C=CC21CCN(CC1)S(=O)(=O)C[C@]12CCC(CC1=O)C2(C)C
InChI Key InChIKey=XDICFWJUUJQOOZ-VCUSLETLSA-N
Data  3 IC50
  Tab Delimited (TSV)   2D SDfile   Computed 3D by Vconf -m prep SDfile
Find this compound or compounds like it in BindingDB:
Activity Spreadsheet -- Enzyme Inhibition Constant Data from BindingDB
Found 3 hits for monomerid = 50001376
TargetOxytocin receptor(RAT)
Merck Research Laboratories
Curated by ChEMBL
LigandPNGBDBM50001376(1-[4,7-dimethylspiro[1H-indene-1,4'-(hexahydropyri...)
Affinity DataIC50:  6.20E+3nM. Assay description: Half-maximal inhibition of binding of [3H]-Oxytocin to OT receptor in rat uterine tissue
In DepthDetails ArticlePubMed
TargetVasopressin V1a/V1b/V2 receptor(RAT)
Merck Research Laboratories
Curated by ChEMBL
LigandPNGBDBM50001376(1-[4,7-dimethylspiro[1H-indene-1,4'-(hexahydropyri...)
Affinity DataIC50: >1.00E+4nM. Assay description: Half-maximal inhibition of binding of [3H]vasopressin to vasopressin receptor 1 in rat liver
In DepthDetails ArticlePubMed
TargetVasopressin V1a/V1b/V2 receptor(RAT)
Merck Research Laboratories
Curated by ChEMBL
LigandPNGBDBM50001376(1-[4,7-dimethylspiro[1H-indene-1,4'-(hexahydropyri...)
Affinity DataIC50: >1.00E+4nM. Assay description: Half-maximal inhibition of binding of [3H]- vasopressin to the vasopressin receptor 2 in rat kidney
In DepthDetails ArticlePubMed