BDBM50001561 5-(6-Imino-3-thiophen-3-yl-6H-pyridazin-1-ylmethyl)-isoxazol-3-ol; hydrate::CHEMBL132060
SMILES N=c1ccc(nn1Cc1cc(=O)[nH]o1)-c1ccsc1
InChI Key InChIKey=XETICWBKUKSDFH-UHFFFAOYSA-N
Data  1 IC50
  Tab Delimited (TSV)   2D SDfile   Computed 3D by Vconf -m prep SDfile
Find this compound or compounds like it in BindingDB:
Activity Spreadsheet -- Enzyme Inhibition Constant Data from BindingDB
Found 1 hit for monomerid = 50001561
TargetGamma-aminobutyric acid receptor subunit alpha-1(Mus musculus)
Centre De Neurochimie Du Cnrs
Curated by ChEMBL
LigandPNGBDBM50001561(5-(6-Imino-3-thiophen-3-yl-6H-pyridazin-1-ylmethyl...)
Affinity DataIC50:  88nM. Assay description: Affinity for gamma-aminobutyric-acid A receptor measured by its ability to displace [3H]gabazine antagonist from rat brain preparations.
In DepthDetails ArticlePubMed