BDBM50001635 6-(4-Phenyl-6-p-tolyl-pyridin-2-yloxy)-hexanoic acid::CHEMBL415687
SMILES Cc1ccc(cc1)-c1cc(cc(OCCCCCC(O)=O)n1)-c1ccccc1
InChI Key InChIKey=PJWFCMIUXWZHRF-UHFFFAOYSA-N
Data  1 IC50
  Tab Delimited (TSV)   2D SDfile   Computed 3D by Vconf -m prep SDfile
Find this compound or compounds like it in BindingDB:
Activity Spreadsheet -- Enzyme Inhibition Constant Data from BindingDB
Found 1 hit for monomerid = 50001635
TargetLeukotriene B4 receptor 1(Homo sapiens (Human))
Centre De Recherche De Vitry-Alfortville
Curated by ChEMBL
LigandPNGBDBM50001635(6-(4-Phenyl-6-p-tolyl-pyridin-2-yloxy)-hexanoic ac...)
Affinity DataIC50:  300nM. Assay description: Inhibition of [3H]-LTB4 binding to Leukotriene B4 receptor in the guinea pig spleen membranes.
In DepthDetails ArticlePubMed