BDBM50001642 6-[4-(4-Amino-phenyl)-6-phenyl-pyridin-2-yloxy]-2-methyl-hexanoic acid::CHEMBL137247
SMILES CC(CCCCOc1cc(cc(n1)-c1ccccc1)-c1ccc(N)cc1)C(O)=O
InChI Key InChIKey=YPQOOYZVTZBYNN-UHFFFAOYSA-N
Data  3 IC50
  Tab Delimited (TSV)   2D SDfile   Computed 3D by Vconf -m prep SDfile
Find this compound or compounds like it in BindingDB:
Activity Spreadsheet -- Enzyme Inhibition Constant Data from BindingDB
Found 3 hits for monomerid = 50001642
TargetLeukotriene B4 receptor 1(Homo sapiens (Human))
Centre De Recherche De Vitry-Alfortville
Curated by ChEMBL
LigandPNGBDBM50001642(6-[4-(4-Amino-phenyl)-6-phenyl-pyridin-2-yloxy]-2-...)
Affinity DataIC50:  30nM. Assay description: Inhibition of [3H]-LTB4 binding to Leukotriene B4 receptor in the human polymorphonuclear leukocytes.
In DepthDetails ArticlePubMed
TargetLeukotriene B4 receptor 1(Homo sapiens (Human))
Centre De Recherche De Vitry-Alfortville
Curated by ChEMBL
LigandPNGBDBM50001642(6-[4-(4-Amino-phenyl)-6-phenyl-pyridin-2-yloxy]-2-...)
Affinity DataIC50:  5nM. Assay description: Inhibition of [3H]-LTB4 binding to Leukotriene B4 receptor in the guinea pig spleen membranes.
In DepthDetails ArticlePubMed
TargetLeukotriene B4 receptor 1(Homo sapiens (Human))
Centre De Recherche De Vitry-Alfortville
Curated by ChEMBL
LigandPNGBDBM50001642(6-[4-(4-Amino-phenyl)-6-phenyl-pyridin-2-yloxy]-2-...)
Affinity DataIC50:  15nM. Assay description: Inhibition of [3H]-LTB4 binding to Leukotriene B4 receptor in the guinea pig spleen membranes.
In DepthDetails ArticlePubMed