BDBM50001654 6-[4-Phenyl-6-(4-trifluoromethyl-phenyl)-pyridin-2-yloxy]-hexanoic acid::CHEMBL137480
SMILES OC(=O)CCCCCOc1cc(cc(n1)-c1ccc(cc1)C(F)(F)F)-c1ccccc1
InChI Key InChIKey=HIWNLVBKMGKUMA-UHFFFAOYSA-N
Data  2 IC50
  Tab Delimited (TSV)   2D SDfile   Computed 3D by Vconf -m prep SDfile
Find this compound or compounds like it in BindingDB:
Activity Spreadsheet -- Enzyme Inhibition Constant Data from BindingDB
Found 2 hits for monomerid = 50001654
TargetLeukotriene B4 receptor 1(Homo sapiens (Human))
Centre De Recherche De Vitry-Alfortville
Curated by ChEMBL
LigandPNGBDBM50001654(6-[4-Phenyl-6-(4-trifluoromethyl-phenyl)-pyridin-2...)
Affinity DataIC50:  1.20E+3nM. Assay description: Inhibition of [3H]-LTB4 binding to Leukotriene B4 receptor in the guinea pig spleen membranes.
In DepthDetails ArticlePubMed
TargetLeukotriene B4 receptor 1(Homo sapiens (Human))
Centre De Recherche De Vitry-Alfortville
Curated by ChEMBL
LigandPNGBDBM50001654(6-[4-Phenyl-6-(4-trifluoromethyl-phenyl)-pyridin-2...)
Affinity DataIC50: >1.00E+4nM. Assay description: Inhibition of LTB4-induced elastase release in human polymorphonuclear leukocytes
In DepthDetails ArticlePubMed