BDBM50001699 CHEMBL3238069
SMILES [H][C@@]12CCCN1C(=O)[C@H](Cc1cnc[nH]1)NC(=O)[C@H](CO)NC(=O)[C@]1([H])CSSC[C@H](NC(=O)[C@H](Cc3ccc(O)cc3)NC(=O)[C@H](CCCC)NC(=O)[C@H](CC)NC(=O)[C@H](Cc3ccccc3)NC(=O)[C@]([H])(CSSC[C@H](NC(=O)CN)C(=O)N1)NC(=O)[C@H](CC)NC2=O)C(O)=O
InChI Key InChIKey=UYZAGZOZDGSJIE-OMTQQZEYSA-N
Data  3 IC50
  Tab Delimited (TSV)   2D SDfile   Computed 3D by Vconf -m prep SDfile
Find this compound or compounds like it in BindingDB:
Activity Spreadsheet -- Enzyme Inhibition Constant Data from BindingDB
Found 3 hits for monomerid = 50001699
TargetNeuronal acetylcholine receptor subunit alpha-3/beta-4(Rattus norvegicus (Rat))
Torrey Pines Institute For Molecular Studies
Curated by ChEMBL
LigandPNGBDBM50001699(CHEMBL3238069)
Affinity DataIC50:  307nM. Assay description: Antagonist activity at rat alpha3beta4 nAChR expressed in HEK293 cells assessed as inhibition of epibatadine-induced effect after 30 mins by fluoresc...
In DepthDetails ArticlePubMed
TargetNeuronal acetylcholine receptor subunit alpha-4/beta-2(Rattus norvegicus (Rat))
Torrey Pines Institute For Molecular Studies
Curated by ChEMBL
LigandPNGBDBM50001699(CHEMBL3238069)
Affinity DataIC50: >1.00E+4nM. Assay description: Antagonist activity at rat alpha4beta2 nAChR expressed in HEK293 cells assessed as inhibition of epibatadine-induced effect after 30 mins by fluoresc...
In DepthDetails ArticlePubMed
TargetNeuronal acetylcholine receptor subunit alpha-3/beta-2(Rattus norvegicus (Rat))
Torrey Pines Institute For Molecular Studies
Curated by ChEMBL
LigandPNGBDBM50001699(CHEMBL3238069)
Affinity DataIC50: >1.00E+4nM. Assay description: Antagonist activity at rat alpha3beta2 nAChR expressed in HEK293 cells assessed as inhibition of epibatadine-induced effect after 30 mins by fluoresc...
In DepthDetails ArticlePubMed