BDBM50001723 4-[2-{2-[2-Amino-3-(4-hydroxy-phenyl)-propionylamino]-propionylamino}-3-(4-amino-phenyl)-propionylamino]-4-{1-[1-(carbamoylmethyl-carbamoyl)-2-methyl-propylcarbamoyl]-2-methyl-propylcarbamoyl}-butyric acid::CHEMBL140845
SMILES CC(C)[C@H](NC(=O)[C@@H](NC(=O)[C@H](CCC(O)=O)NC(=O)[C@H](Cc1ccc(N)cc1)NC(=O)[C@@H](C)NC(=O)[C@@H](N)Cc1ccc(O)cc1)C(C)C)C(=O)NCC(N)=O
InChI Key InChIKey=LNDPSDXTCVDAAF-JMZWVCJUSA-N
Data  2 KI
  Tab Delimited (TSV)   2D SDfile   Computed 3D by Vconf -m prep SDfile
Find this compound or compounds like it in BindingDB:
Activity Spreadsheet -- Enzyme Inhibition Constant Data from BindingDB
Found 2 hits for monomerid = 50001723
TargetDelta-type opioid receptor(Rattus norvegicus (rat))
University Of Ferrara
Curated by ChEMBL
LigandPNGBDBM50001723(4-[2-{2-[2-Amino-3-(4-hydroxy-phenyl)-propionylami...)
Affinity DataKi:  48nM. Assay description: Binding affinity against opioid receptor delta in rats by displacing [3H]-DPDPE
In DepthDetails ArticlePubMed
TargetMu-type opioid receptor(Rattus norvegicus (rat))
University Of Ferrara
Curated by ChEMBL
LigandPNGBDBM50001723(4-[2-{2-[2-Amino-3-(4-hydroxy-phenyl)-propionylami...)
Affinity DataKi:  2.46E+3nM. Assay description: Binding affinity against opioid receptor mu in rats by displacing [3H]-DAGO
In DepthDetails ArticlePubMed