BDBM50001793 1-Isopropyl-3-{2-[4-(6-methyl-1H-indol-3-yl)-piperidin-1-yl]-ethyl}-imidazolidin-2-one::CHEMBL145460
SMILES CC(C)N1CCN(CCN2CCC(CC2)c2c[nH]c3cc(C)ccc23)C1=O
InChI Key InChIKey=QGVAEWBRFSNZBU-UHFFFAOYSA-N
Data  3 IC50
  Tab Delimited (TSV)   2D SDfile   Computed 3D by Vconf -m prep SDfile
Find this compound or compounds like it in BindingDB:
Activity Spreadsheet -- Enzyme Inhibition Constant Data from BindingDB
Found 3 hits for monomerid = 50001793
TargetD(2) dopamine receptor(Rattus norvegicus (rat))
H. Lundbeck
Curated by ChEMBL
LigandPNGBDBM50001793(1-Isopropyl-3-{2-[4-(6-methyl-1H-indol-3-yl)-piper...)
Affinity DataIC50:  590nM. Assay description: Displacement of [3H]-spiperone from Dopamine receptor D2 from rat striatal membranes
In DepthDetails ArticlePubMed
TargetAlpha-1A/Alpha-1B/Alpha-1D adrenergic receptor(Rattus norvegicus (rat))
H. Lundbeck
Curated by ChEMBL
LigandPNGBDBM50001793(1-Isopropyl-3-{2-[4-(6-methyl-1H-indol-3-yl)-piper...)
Affinity DataIC50:  27nM. Assay description: Displacement of [3H]prazosin from Alpha-1 adrenergic receptor of whole rat brain membranes
In DepthDetails ArticlePubMed
TargetSerotonin 2 (5-HT2) receptor(RAT)
H. Lundbeck
Curated by ChEMBL
LigandPNGBDBM50001793(1-Isopropyl-3-{2-[4-(6-methyl-1H-indol-3-yl)-piper...)
Affinity DataIC50:  60nM. Assay description: Displacement of [3H]ketanserin from 5-hydroxytryptamine 2 receptor from rat cortical membranes.
In DepthDetails ArticlePubMed