BDBM50001801 3-(4-Fluoro-phenyl)-5-methyl-1-(1-methyl-piperidin-4-yl)-1H-indole::CHEMBL344335
SMILES CN1CCC(CC1)n1cc(-c2ccc(F)cc2)c2cc(C)ccc12
InChI Key InChIKey=UJOWBALLYUQQQK-UHFFFAOYSA-N
Data  3 IC50
  Tab Delimited (TSV)   2D SDfile   Computed 3D by Vconf -m prep SDfile
Find this compound or compounds like it in BindingDB:
Activity Spreadsheet -- Enzyme Inhibition Constant Data from BindingDB
Found 3 hits for monomerid = 50001801
TargetD(2) dopamine receptor(Rattus norvegicus (rat))
H. Lundbeck
Curated by ChEMBL
LigandPNGBDBM50001801(3-(4-Fluoro-phenyl)-5-methyl-1-(1-methyl-piperidin...)
Affinity DataIC50:  540nM. Assay description: Displacement of [3H]-spiperone from Dopamine receptor D2 rat striatal membranes
In DepthDetails ArticlePubMed
TargetSerotonin 2 (5-HT2) receptor(RAT)
H. Lundbeck
Curated by ChEMBL
LigandPNGBDBM50001801(3-(4-Fluoro-phenyl)-5-methyl-1-(1-methyl-piperidin...)
Affinity DataIC50:  4.5nM. Assay description: Displacement of [3H]ketanserin from 5-hydroxytryptamine 2 receptor in rat cortical membranes
In DepthDetails ArticlePubMed
TargetAlpha-1A adrenergic receptor(Rattus norvegicus (Rat))
H. Lundbeck
Curated by ChEMBL
LigandPNGBDBM50001801(3-(4-Fluoro-phenyl)-5-methyl-1-(1-methyl-piperidin...)
Affinity DataIC50:  190nM. Assay description: Displacement of [3H]-prazosin from Alpha-1 adrenergic receptor in whole rat brain membranes
In DepthDetails ArticlePubMed