BDBM50001891 1-{5-[4-(2-Hydroxy-phenyl)-piperazin-1-ylmethyl]-1-methyl-1H-pyrrol-2-ylmethyl}-pyrrolidin-2-one::CHEMBL152617
SMILES Cn1c(CN2CCCC2=O)ccc1CN1CCN(CC1)c1ccccc1O
InChI Key InChIKey=YZSKSIBYNQHPBG-UHFFFAOYSA-N
Data  2 KI
  Tab Delimited (TSV)   2D SDfile   Computed 3D by Vconf -m prep SDfile
Find this compound or compounds like it in BindingDB:
Activity Spreadsheet -- Enzyme Inhibition Constant Data from BindingDB
Found 2 hits for monomerid = 50001891
TargetAlpha-1A/Alpha-1B/Alpha-1D adrenergic receptor(Rattus norvegicus (rat))
R. W. Johnson Pharmaceutical Research Institute
Curated by ChEMBL
LigandPNGBDBM50001891(1-{5-[4-(2-Hydroxy-phenyl)-piperazin-1-ylmethyl]-1...)
Affinity DataKi:  140nM. Assay description: The compound was tested for its binding affinity towards Alpha-1 adrenergic receptor by displacing [3H]WB-4101 radioligand in rat cerebral cortex
In DepthDetails ArticlePubMed
TargetD(2) dopamine receptor(Rattus norvegicus (rat))
R. W. Johnson Pharmaceutical Research Institute
Curated by ChEMBL
LigandPNGBDBM50001891(1-{5-[4-(2-Hydroxy-phenyl)-piperazin-1-ylmethyl]-1...)
Affinity DataKi: >1.00E+3nM. Assay description: Binding affinity towards dopamine receptor D2 by displacing [3H]spiperone radioligand in rat striatum
In DepthDetails ArticlePubMed