BDBM50001906 4-Methanesulfonylamino-N-[4-(2-methoxy-phenyl)-piperazin-2-ylmethyl]-benzamide::CHEMBL349978
SMILES COc1ccccc1N1CCNC(CNC(=O)c2ccc(NS(C)(=O)=O)cc2)C1
InChI Key InChIKey=KSSFMKSIGXBNOC-UHFFFAOYSA-N
Data  2 IC50
  Tab Delimited (TSV)   2D SDfile   Computed 3D by Vconf -m prep SDfile
Find this compound or compounds like it in BindingDB:
Activity Spreadsheet -- Enzyme Inhibition Constant Data from BindingDB
Found 2 hits for monomerid = 50001906
TargetBeta-2 adrenergic receptor(Canis familiaris)
Berlex Laboratories
Curated by ChEMBL
LigandPNGBDBM50001906(4-Methanesulfonylamino-N-[4-(2-methoxy-phenyl)-pip...)
Affinity DataIC50:  630nM. Assay description: Binding affinity towards Beta-2 adrenergic receptor by displacing [3H]dihydroalprenolol, in partially purified membrane fractions from canine lung ti...
In DepthDetails ArticlePubMed
TargetBeta-1 adrenergic receptor(Homo sapiens (Human))
Berlex Laboratories
Curated by ChEMBL
LigandPNGBDBM50001906(4-Methanesulfonylamino-N-[4-(2-methoxy-phenyl)-pip...)
Affinity DataIC50:  230nM. Assay description: Binding affinity for Beta-1 adrenergic receptor by displacing [3H]dihydroalprenolol, in partially purified membrane fractions from canine ventricular...
In DepthDetails ArticlePubMed