BDBM50001911 1-p-Tolyl-piperazine::CHEMBL165462
SMILES Cc1ccc(cc1)N1CCNCC1
InChI Key InChIKey=ONEYFZXGNFNRJH-UHFFFAOYSA-N
Data  2 IC50
  Tab Delimited (TSV)   2D SDfile   Computed 3D by Vconf -m prep SDfile
Find this compound or compounds like it in BindingDB:
Activity Spreadsheet -- Enzyme Inhibition Constant Data from BindingDB
Found 2 hits for monomerid = 50001911
TargetBeta-1 adrenergic receptor(Homo sapiens (Human))
Berlex Laboratories
Curated by ChEMBL
LigandPNGBDBM50001911(1-p-Tolyl-piperazine | CHEMBL165462)
Affinity DataIC50:  3.80E+4nM. Assay description: Binding affinity for Beta-1 adrenergic receptor by displacing [3H]dihydroalprenolol, in partially purified membrane fractions from canine ventricular...
In DepthDetails ArticlePubMed
TargetBeta-2 adrenergic receptor(Canis familiaris)
Berlex Laboratories
Curated by ChEMBL
LigandPNGBDBM50001911(1-p-Tolyl-piperazine | CHEMBL165462)
Affinity DataIC50: >1.00E+5nM. Assay description: Binding affinity towards Beta-2 adrenergic receptor by displacing [3H]dihydroalprenolol, in partially purified membrane fractions from canine lung ti...
In DepthDetails ArticlePubMed