BDBM50001995 2-{4-[5-Chloro-1-(4-fluoro-phenyl)-1H-indol-3-yl]-piperidin-1-yl}-ethanol::CHEMBL430151
SMILES OCCN1CCC(CC1)c1cn(-c2ccc(F)cc2)c2ccc(Cl)cc12
InChI Key InChIKey=ANOQQUDEPUAIRE-UHFFFAOYSA-N
Data  2 IC50
  Tab Delimited (TSV)   2D SDfile   Computed 3D by Vconf -m prep SDfile
Find this compound or compounds like it in BindingDB:
Activity Spreadsheet -- Enzyme Inhibition Constant Data from BindingDB
Found 2 hits for monomerid = 50001995
TargetSerotonin 2 (5-HT2) receptor(RAT)
H. Lundbeck
Curated by ChEMBL
LigandPNGBDBM50001995(2-{4-[5-Chloro-1-(4-fluoro-phenyl)-1H-indol-3-yl]-...)
Affinity DataIC50:  2.70nM. Assay description: Inhibition of [3H]ketanserin binding to rat 5-hydroxytryptamine 2 receptors.
In DepthDetails ArticlePubMed
TargetD(2) dopamine receptor(Rattus norvegicus (rat))
H. Lundbeck
Curated by ChEMBL
LigandPNGBDBM50001995(2-{4-[5-Chloro-1-(4-fluoro-phenyl)-1H-indol-3-yl]-...)
Affinity DataIC50:  4.5nM. Assay description: Tested for the inhibition of [3H]-spiperone binding to dopamine D2 receptor
In DepthDetails ArticlePubMed