BDBM50002127 2-(3-Methoxy-phenyl)-4-propyl-morpholine::2-(3-methoxyphenyl)-4-propylmorpholine::CHEMBL101480
SMILES CCCN1CCOC(C1)c1cccc(OC)c1
InChI Key InChIKey=BLVMMLMFXYKMPX-UHFFFAOYSA-N
Data  1 IC50  2 EC50
  Tab Delimited (TSV)   2D SDfile   Computed 3D by Vconf -m prep SDfile
Find this compound or compounds like it in BindingDB:
Activity Spreadsheet -- Enzyme Inhibition Constant Data from BindingDB
Found 3 hits for monomerid = 50002127
Target5-hydroxytryptamine receptor 1A/1B/1D/1F(RAT)
Universit£
Curated by ChEMBL
LigandPNGBDBM50002127(2-(3-Methoxy-phenyl)-4-propyl-morpholine | 2-(3-me...)
Affinity DataIC50:  1.00E+3nM. Assay description: Inhibition of human erythrocyte carbonic anhydrase II
In DepthDetails ArticlePubMed
TargetD(3) dopamine receptor(Homo sapiens (Human))
Pfizer
Curated by ChEMBL
LigandPNGBDBM50002127(2-(3-Methoxy-phenyl)-4-propyl-morpholine | 2-(3-me...)
Affinity DataEC50: >1.00E+3nM. Assay description: Agonist activity at human recombinant dopamine D3 receptor expressed in CHO cells assessed as inhibition of forskolin-stimulated cAMP accumulation
In DepthDetails ArticlePubMed
TargetD(2) dopamine receptor(Homo sapiens (Human))
Pfizer
Curated by ChEMBL
LigandPNGBDBM50002127(2-(3-Methoxy-phenyl)-4-propyl-morpholine | 2-(3-me...)
Affinity DataEC50: >1.00E+4nM. Assay description: Agonist activity at human recombinant dopamine D2 receptor expressed in rat pituitary cells assessed as inhibition of forskolin-stimulated cAMP accum...
In DepthDetails ArticlePubMed