BDBM50002130 3-(2-Methoxy-phenyl)-1-propyl-piperidine::3-(2-Methoxy-phenyl)-1-propyl-piperidine;HCl::CHEMBL285709
SMILES CCCN1CCCC(C1)c1ccccc1OC
InChI Key InChIKey=UGSUUBPXDJGUAQ-UHFFFAOYSA-N
Data  1 IC50
  Tab Delimited (TSV)   2D SDfile   Computed 3D by Vconf -m prep SDfile
Find this compound or compounds like it in BindingDB:
Activity Spreadsheet -- Enzyme Inhibition Constant Data from BindingDB
Found 1 hit for monomerid = 50002130
TargetD(2) dopamine receptor(Rattus norvegicus (rat))
Universit£
Curated by ChEMBL
LigandPNGBDBM50002130(3-(2-Methoxy-phenyl)-1-propyl-piperidine | 3-(2-Me...)
Affinity DataIC50:  8.00E+3nM. Assay description: Ability to displace [3H]spiroperidol, from dopamine receptor D2 specific binding sites of rat striatal membranes
In DepthDetails ArticlePubMed