BDBM50002141 3-Methyl-8-piperazin-1-yl-2,3-dihydro-imidazo[1,2-a]pyrazine; compound with 2M.hex-3-enedioic acid::CHEMBL126394
SMILES CC1CN=C2N1C=CN=C2N1CCNCC1
InChI Key InChIKey=FNXRPSLJPVZLGZ-UHFFFAOYSA-N
Data  3 KI
  Tab Delimited (TSV)   2D SDfile   Computed 3D by Vconf -m prep SDfile
Find this compound or compounds like it in BindingDB:
Activity Spreadsheet -- Enzyme Inhibition Constant Data from BindingDB
Found 3 hits for monomerid = 50002141
TargetAlpha-2A adrenergic receptor(BOVINE)
Merck Sharp And Dohme Research Laboratories
Curated by ChEMBL
LigandPNGBDBM50002141(3-Methyl-8-piperazin-1-yl-2,3-dihydro-imidazo[1,2-...)
Affinity DataKi:  1.60E+3nM. Assay description: Binding affinity at Alpha-2 adrenergic receptor in calf cerebral cortex homogenates by [3H]clonidine displacement.
In DepthDetails ArticlePubMed
TargetBeta-1 adrenergic receptor(GUINEA PIG)
Merck Sharp And Dohme Research Laboratories
Curated by ChEMBL
LigandPNGBDBM50002141(3-Methyl-8-piperazin-1-yl-2,3-dihydro-imidazo[1,2-...)
Affinity DataKi:  1.03E+4nM. Assay description: Binding affinity at Beta-1 adrenergic receptor in guinea pigs by [125I]CYP displacement
In DepthDetails ArticlePubMed
TargetBeta-2 adrenergic receptor(GUINEA PIG)
Merck Sharp And Dohme Research Laboratories
Curated by ChEMBL
LigandPNGBDBM50002141(3-Methyl-8-piperazin-1-yl-2,3-dihydro-imidazo[1,2-...)
Affinity DataKi:  1.77E+4nM. Assay description: Binding affinity against Beta-2 adrenergic receptor was measured using [125I]CYP as radioligand
In DepthDetails ArticlePubMed