BDBM50002148 8-Piperazin-1-yl-2,3-dihydro-imidazo[1,2-a]pyrazine; compound with 2M.hex-3-enedioic acid::CHEMBL340358
SMILES C1CN2C=CN=C(N3CCNCC3)C2=N1
InChI Key InChIKey=CILJULJFHQTTRG-UHFFFAOYSA-N
Data  1 KI
  Tab Delimited (TSV)   2D SDfile   Computed 3D by Vconf -m prep SDfile
Find this compound or compounds like it in BindingDB:
Activity Spreadsheet -- Enzyme Inhibition Constant Data from BindingDB
Found 1 hit for monomerid = 50002148
TargetAlpha-2A adrenergic receptor(BOVINE)
Merck Sharp And Dohme Research Laboratories
Curated by ChEMBL
LigandPNGBDBM50002148(8-Piperazin-1-yl-2,3-dihydro-imidazo[1,2-a]pyrazin...)
Affinity DataKi:  870nM. Assay description: Binding affinity at Alpha-2 adrenergic receptor in calf cerebral cortex homogenates by [3H]clonidine displacement.
In DepthDetails ArticlePubMed