BDBM50002286 CHEMBL439609::[3-(1-Cyclopropylmethyl-piperidin-4-ylmethoxy)-phenyl]-dimethyl-amine;0.1hydrate
SMILES CN(C)c1cccc(OCC2CCN(CC3CC3)CC2)c1
InChI Key InChIKey=QGAPHPYAEAZBIR-UHFFFAOYSA-N
Data  2 KI  1 IC50
  Tab Delimited (TSV)   2D SDfile   Computed 3D by Vconf -m prep SDfile
Find this compound or compounds like it in BindingDB:
Activity Spreadsheet -- Enzyme Inhibition Constant Data from BindingDB
Found 3 hits for monomerid = 50002286
TargetSigma non-opioid intracellular receptor 1(Mus musculus (Mouse))
Dupont Pharmaceuticals
Curated by ChEMBL
LigandPNGBDBM50002286(CHEMBL439609 | [3-(1-Cyclopropylmethyl-piperidin-4...)
Affinity DataKi:  5nM. Assay description: In vitro binding affinity for the mouse sigma opioid receptor
In DepthDetails ArticlePubMed
Target5-hydroxytryptamine receptor 2A/2B/2C(Mus musculus (Mouse))
Dupont Pharmaceuticals
Curated by ChEMBL
LigandPNGBDBM50002286(CHEMBL439609 | [3-(1-Cyclopropylmethyl-piperidin-4...)
Affinity DataKi:  1.16E+3nM. Assay description: In vitro binding affinity for serotonin 5-hydroxytryptamine (5-HT) 2 receptors
In DepthDetails ArticlePubMed
TargetD(2) dopamine receptor(Mus musculus (Mouse))
Dupont Pharmaceuticals
Curated by ChEMBL
LigandPNGBDBM50002286(CHEMBL439609 | [3-(1-Cyclopropylmethyl-piperidin-4...)
Affinity DataIC50:  7.33E+3nM. Assay description: In vitro binding affinity towards dopamine receptor D2
In DepthDetails ArticlePubMed