BDBM50002317 2-(4-Fluoro-phenyl)-5-[4-(5-fluoro-pyrimidin-2-yl)-piperazin-1-yl]-pentanenitrile::CHEMBL443482
SMILES Fc1ccc(cc1)C(CCCN1CCN(CC1)c1ncc(F)cn1)C#N
InChI Key InChIKey=PLLXGFQSUXATSU-UHFFFAOYSA-N
Data  3 IC50
  Tab Delimited (TSV)   2D SDfile   Computed 3D by Vconf -m prep SDfile
Find this compound or compounds like it in BindingDB:
Activity Spreadsheet -- Enzyme Inhibition Constant Data from BindingDB
Found 3 hits for monomerid = 50002317
TargetD(2) dopamine receptor(Rattus norvegicus (rat))
Bristol-Myers Squibb
Curated by ChEMBL
LigandPNGBDBM50002317(2-(4-Fluoro-phenyl)-5-[4-(5-fluoro-pyrimidin-2-yl)...)
Affinity DataIC50:  1.88E+3nM. Assay description: In vitro inhibitory against radioligand [3H]spiperone binding to rat striatal Dopamine receptor D2
In DepthDetails ArticlePubMed
TargetAlpha-1A/Alpha-1B/Alpha-1D adrenergic receptor(Rattus norvegicus (rat))
Bristol-Myers Squibb
Curated by ChEMBL
LigandPNGBDBM50002317(2-(4-Fluoro-phenyl)-5-[4-(5-fluoro-pyrimidin-2-yl)...)
Affinity DataIC50:  266nM. Assay description: Inhibition of [3H]WB-4101 binding to rat cortical Alpha-1 adrenergic receptor in vitro
In DepthDetails ArticlePubMed
TargetSigma non-opioid intracellular receptor 1(RAT)
Bristol-Myers Squibb
Curated by ChEMBL
LigandPNGBDBM50002317(2-(4-Fluoro-phenyl)-5-[4-(5-fluoro-pyrimidin-2-yl)...)
Affinity DataIC50:  190nM. Assay description: Displacement of (+)-[3H]-3-PPP from rat cortical sigma site
In DepthDetails ArticlePubMed