BDBM50002328 4-[4-(5-Fluoro-4-methylsulfanyl-pyrimidin-2-yl)-piperazin-1-yl]-1-(4-fluoro-phenyl)-butan-1-one::CHEMBL141455
SMILES CSc1nc(ncc1F)N1CCN(CCCC(=O)c2ccc(F)cc2)CC1
InChI Key InChIKey=TVZQYADMEATGII-UHFFFAOYSA-N
Data  3 IC50
  Tab Delimited (TSV)   2D SDfile   Computed 3D by Vconf -m prep SDfile
Find this compound or compounds like it in BindingDB:
Activity Spreadsheet -- Enzyme Inhibition Constant Data from BindingDB
Found 3 hits for monomerid = 50002328
TargetSigma non-opioid intracellular receptor 1(RAT)
Bristol-Myers Squibb
Curated by ChEMBL
LigandPNGBDBM50002328(4-[4-(5-Fluoro-4-methylsulfanyl-pyrimidin-2-yl)-pi...)
Affinity DataIC50:  120nM. Assay description: Displacement of (+)-[3H]-3-PPP from rat cortical sigma site
In DepthDetails ArticlePubMed
TargetAlpha-1A/Alpha-1B/Alpha-1D adrenergic receptor(Rattus norvegicus (rat))
Bristol-Myers Squibb
Curated by ChEMBL
LigandPNGBDBM50002328(4-[4-(5-Fluoro-4-methylsulfanyl-pyrimidin-2-yl)-pi...)
Affinity DataIC50:  95nM. Assay description: Inhibition of [3H]WB-4101 binding to rat cortical Alpha-1 adrenergic receptor in vitro
In DepthDetails ArticlePubMed
TargetD(2) dopamine receptor(Rattus norvegicus (rat))
Bristol-Myers Squibb
Curated by ChEMBL
LigandPNGBDBM50002328(4-[4-(5-Fluoro-4-methylsulfanyl-pyrimidin-2-yl)-pi...)
Affinity DataIC50:  396nM. Assay description: In vitro inhibitory against radioligand [3H]spiperone binding to rat striatal Dopamine receptor D2
In DepthDetails ArticlePubMed