BDBM50002351 CHEMBL3233608
SMILES Cc1cc(c(C)n1CC1CCCO1)-c1csc(N)n1
InChI Key InChIKey=IUSOSUNODUAXAY-UHFFFAOYSA-N
Data  1 IC50
PDB links: 1 PDB ID matches this monomer.
  Tab Delimited (TSV)   2D SDfile   Computed 3D by Vconf -m prep SDfile
Find this compound or compounds like it in BindingDB:
Activity Spreadsheet -- Enzyme Inhibition Constant Data from BindingDB
Found 1 hit for monomerid = 50002351
TargetBifunctional epoxide hydrolase 2(Homo sapiens (Human))
Astellas Pharma
Curated by ChEMBL
LigandPNGBDBM50002351(CHEMBL3233608)
Affinity DataIC50:  1.95E+5nM. Assay description: Inhibition of human full-length C-terminal His6-tagged sEH expressed in Escherichia coli BL21(DE3) cells using PHOME as substrate incubated with enzy...