BDBM50002409 9-(4-Phenyl-pyrazol-1-yl)-nonanoic acid::CHEMBL129374
SMILES OC(=O)CCCCCCCCn1cc(cn1)-c1ccccc1
InChI Key InChIKey=GMOKEGDNKBXVDW-UHFFFAOYSA-N
Data  1 IC50
  Tab Delimited (TSV)   2D SDfile   Computed 3D by Vconf -m prep SDfile
Find this compound or compounds like it in BindingDB:
Activity Spreadsheet -- Enzyme Inhibition Constant Data from BindingDB
Found 1 hit for monomerid = 50002409
TargetProstacyclin receptor(Homo sapiens (Human))
Bristol-Myers Squibb Pharmaceutical Research Institute
Curated by ChEMBL
LigandPNGBDBM50002409(9-(4-Phenyl-pyrazol-1-yl)-nonanoic acid | CHEMBL12...)
Affinity DataIC50: >1.00E+4nM. Assay description: IC50 value of the compound was evaluated by measuring the displacement of [3H]-iloprost from Prostaglandin I2 receptor
In DepthDetails ArticlePubMed