BDBM50002479 3-[2-[2-tert-Butoxycarbonylamino-3-(1H-indol-3-yl)-propionylamino]-6-(3-phenyl-acryloylamino)-hexanoylamino]-N-(1-carbamoyl-2-phenyl-ethyl)-succinamic acid.AcOH::CHEMBL3144539
SMILES CC(C)(C)OC(=O)N[C@@H](Cc1c[nH]c2ccccc12)C(=O)N[C@@H](CCCCNC(=O)\C=C/c1ccccc1)C(=O)N[C@@H](CC(O)=O)C(=O)N[C@@H](Cc1ccccc1)C(N)=O
InChI Key InChIKey=HISBBQBOZDPJJS-QTNFWPTDSA-N
Data  2 IC50
  Tab Delimited (TSV)   2D SDfile   Computed 3D by Vconf -m prep SDfile
Find this compound or compounds like it in BindingDB:
Activity Spreadsheet -- Enzyme Inhibition Constant Data from BindingDB
Found 2 hits for monomerid = 50002479
TargetGastrin/cholecystokinin type B receptor(Homo sapiens (Human))
Abbott Laboratories
Curated by ChEMBL
LigandPNGBDBM50002479(3-[2-[2-tert-Butoxycarbonylamino-3-(1H-indol-3-yl)...)
Affinity DataIC50:  1.80E+3nM. Assay description: Inhibition of specific binding of [125I]BH-CCK-8 in guinea pig cortex
In DepthDetails ArticlePubMed
TargetCholecystokinin receptor type A(Cavia porcellus)
Abbott Laboratories
Curated by ChEMBL
LigandPNGBDBM50002479(3-[2-[2-tert-Butoxycarbonylamino-3-(1H-indol-3-yl)...)
Affinity DataIC50:  55nM. Assay description: Inhibition of specific binding of [125I]BH-CCK-8 in guinea pig pancreas.
In DepthDetails ArticlePubMed