BDBM50002549 CHEMBL64037::tert-butyloxycarbonyl-D-Trp-D-Trp-Phe-amine
SMILES CC(C)(C)OC(=O)N[C@H](Cc1c[nH]c2ccccc12)C(=O)N[C@H](Cc1c[nH]c2ccccc12)C(=O)N[C@@H](Cc1ccccc1)C(N)=O
InChI Key InChIKey=GVFKWPVILCUDOW-OJDZSJEKSA-N
Data  1 IC50
  Tab Delimited (TSV)   2D SDfile   Computed 3D by Vconf -m prep SDfile
Find this compound or compounds like it in BindingDB:
Activity Spreadsheet -- Enzyme Inhibition Constant Data from BindingDB
Found 1 hit for monomerid = 50002549
TargetSubstance-P receptor(GUINEA PIG)
Fujisawa Pharmaceutical
Curated by ChEMBL
LigandPNGBDBM50002549(CHEMBL64037 | tert-butyloxycarbonyl-D-Trp-D-Trp-Ph...)
Affinity DataIC50:  1.76E+4nM. Assay description: Displacement of specific binding of [3H]SP to tachykinin receptor 1 from the isolated guinea pig tracheal strips
In DepthDetails ArticlePubMed