BDBM50002560 CHEMBL294814::benzyl 2-[1-[3-carbamoyl-1-neopentylcarboxamido-(1S)-propylcarboxamido]-2-phenyl-(1R)-ethylcarboxamido]-3-phenyl-(2S)-propanoate
SMILES CC(C)(C)OC(=O)N[C@@H](CCC(N)=O)C(=O)N[C@H](Cc1ccccc1)C(=O)N[C@@H](Cc1ccccc1)C(=O)OCc1ccccc1
InChI Key InChIKey=HMADXAQGJPJKOM-NHKHRBQYSA-N
Data  1 IC50
  Tab Delimited (TSV)   2D SDfile   Computed 3D by Vconf -m prep SDfile
Find this compound or compounds like it in BindingDB:
Activity Spreadsheet -- Enzyme Inhibition Constant Data from BindingDB
Found 1 hit for monomerid = 50002560
TargetSubstance-P receptor(GUINEA PIG)
Fujisawa Pharmaceutical
Curated by ChEMBL
LigandPNGBDBM50002560(CHEMBL294814 | benzyl 2-[1-[3-carbamoyl-1-neopenty...)
Affinity DataIC50:  380nM. Assay description: Displacement of specific binding of [3H]SP to tachykinin receptor 1 from the isolated guinea pig tracheal strips
In DepthDetails ArticlePubMed