BDBM50002572 2-[1-[1-amino-2-phenyl-(1S)-ethylcarboxamido]-2-(1H-3-indolyl)-(1R)-ethylcarboxamido]-3-(1H-3-indolyl)-(2R)-propanoic acid; hydrochloride::CHEMBL558620
SMILES N[C@@H](Cc1ccccc1)C(=O)N[C@H](Cc1c[nH]c2ccccc12)C(=O)N[C@H](Cc1c[nH]c2ccccc12)C(O)=O
InChI Key InChIKey=MJOJSHOTYWABPR-HNPKZYAISA-N
Data  1 IC50
  Tab Delimited (TSV)   2D SDfile   Computed 3D by Vconf -m prep SDfile
Find this compound or compounds like it in BindingDB:
Activity Spreadsheet -- Enzyme Inhibition Constant Data from BindingDB
Found 1 hit for monomerid = 50002572
TargetSubstance-P receptor(GUINEA PIG)
Fujisawa Pharmaceutical
Curated by ChEMBL
LigandPNGBDBM50002572(2-[1-[1-amino-2-phenyl-(1S)-ethylcarboxamido]-2-(1...)
Affinity DataIC50:  5.80E+4nM. Assay description: Displacement of specific binding of [3H]SP to tachykinin receptor 1 from the isolated guinea pig tracheal strips
In DepthDetails ArticlePubMed