BDBM50002596 CHEMBL424866
SMILES O[C@@H](CNCCNc1cccc(c1)-c1cccc(n1)C(O)=O)c1cccc(Cl)c1
InChI Key InChIKey=CQECFJNZZPYKHL-NRFANRHFSA-N
Data  3 EC50
  Tab Delimited (TSV)   2D SDfile   Computed 3D by Vconf -m prep SDfile
Find this compound or compounds like it in BindingDB:
Activity Spreadsheet -- Enzyme Inhibition Constant Data from BindingDB
Found 3 hits for monomerid = 50002596
TargetBeta-2 adrenergic receptor(Homo sapiens (Human))
Glaxosmithkline
Curated by ChEMBL
LigandPNGBDBM50002596(CHEMBL424866)
Affinity DataEC50:  1.00E+4nM. Assay description: Activity at human beta-2 adrenergic receptor expressed in CHO cells by stimulation of cAMP productionChecked by Author
In DepthDetails ArticlePubMed
TargetBeta-3 adrenergic receptor(Homo sapiens (Human))
Glaxosmithkline
Curated by ChEMBL
LigandPNGBDBM50002596(CHEMBL424866)
Affinity DataEC50:  40nM. Assay description: Activity at human beta-3 adrenergic receptor expressed in CHO cells by stimulation of cAMP productionChecked by Author
In DepthDetails ArticlePubMed
TargetBeta-1 adrenergic receptor(Homo sapiens (Human))
Glaxosmithkline
Curated by ChEMBL
LigandPNGBDBM50002596(CHEMBL424866)
Affinity DataEC50:  5.01E+3nM. Assay description: Activity at human beta-1 adrenergic receptor expressed in CHO cells by stimulation of cAMP productionChecked by Author
In DepthDetails ArticlePubMed