BDBM50002759 5-(2-Benzenesulfonylamino-ethylsulfanyl)-5,11-dihydro-10-thia-dibenzo[a,d]cycloheptene-7-carboxylic acid::CHEMBL114901
SMILES OC(=O)c1ccc2SCc3ccccc3C(SCCNS(=O)(=O)c3ccccc3)c2c1
InChI Key InChIKey=KQCDAMXNJBCRPM-UHFFFAOYSA-N
Data  2 KI
  Tab Delimited (TSV)   2D SDfile   Computed 3D by Vconf -m prep SDfile
Find this compound or compounds like it in BindingDB:
Activity Spreadsheet -- Enzyme Inhibition Constant Data from BindingDB
Found 2 hits for monomerid = 50002759
TargetThromboxane A2 receptor(Homo sapiens (Human))
Kyowa Hakko Kogyo
Curated by ChEMBL
LigandPNGBDBM50002759(5-(2-Benzenesulfonylamino-ethylsulfanyl)-5,11-dihy...)
Affinity DataKi:  3.70nM. Assay description: Inhibition of Shh signaling in mouse Shh-light2 cells by Gli-dependent firefly luciferase reporter gene assay
In DepthDetails ArticlePubMed
TargetThromboxane A2 receptor(Homo sapiens (Human))
Kyowa Hakko Kogyo
Curated by ChEMBL
LigandPNGBDBM50002759(5-(2-Benzenesulfonylamino-ethylsulfanyl)-5,11-dihy...)
Affinity DataKi:  3.70nM. Assay description: Binding affinity at TXA2 receptor by measuring its ability to displace [3H]-U-46,619 from guinea pig platelets
In DepthDetails ArticlePubMed