BDBM50002806 1-[2-(2-Carboxy-6H-dibenzo[b,e]oxepin-11-ylidene)-ethyl]-1H-benzoimidazole-5-carboxylic acid (0.25H2O)::CHEMBL116721
SMILES OC(=O)c1ccc2OCc3ccccc3\C(=C/Cn3cnc4cc(ccc34)C(O)=O)c2c1
InChI Key InChIKey=IADICFRWOBAQSG-DJKKODMXSA-N
Data  1 KI
  Tab Delimited (TSV)   2D SDfile   Computed 3D by Vconf -m prep SDfile
Find this compound or compounds like it in BindingDB:
Activity Spreadsheet -- Enzyme Inhibition Constant Data from BindingDB
Found 1 hit for monomerid = 50002806
TargetThromboxane A2 receptor(Homo sapiens (Human))
Kyowa Hakko Kogyo
Curated by ChEMBL
LigandPNGBDBM50002806(1-[2-(2-Carboxy-6H-dibenzo[b,e]oxepin-11-ylidene)-...)
Affinity DataKi:  30nM. Assay description: Binding affinity at TXA2/PGH2 receptor by measuring its ability to displace [3H]-U-46,619 from guinea pig platelets
In DepthDetails ArticlePubMed