BDBM50002812 11-[2-(6-Nitro-benzoimidazol-1-yl)-ethylidene]-6,11-dihydro-dibenzo[b,e]oxepine-2-carboxylic acid::CHEMBL116342
SMILES OC(=O)c1ccc2OCc3ccccc3\C(=C/Cn3cnc4ccc(cc34)[N+]([O-])=O)c2c1
InChI Key InChIKey=XUMPWBQEUCERPH-DJKKODMXSA-N
Data  1 KI
  Tab Delimited (TSV)   2D SDfile   Computed 3D by Vconf -m prep SDfile
Find this compound or compounds like it in BindingDB:
Activity Spreadsheet -- Enzyme Inhibition Constant Data from BindingDB
Found 1 hit for monomerid = 50002812
TargetThromboxane A2 receptor(Homo sapiens (Human))
Kyowa Hakko Kogyo
Curated by ChEMBL
LigandPNGBDBM50002812(11-[2-(6-Nitro-benzoimidazol-1-yl)-ethylidene]-6,1...)
Affinity DataKi:  9.5nM. Assay description: Binding affinity at TXA2/PGH2 receptor by measuring its ability to displace [3H]-U-46,619 from guinea pig platelets
In DepthDetails ArticlePubMed