BDBM50002852 CHEMBL3233926
SMILES Cn1c2ccccc2c(O)c(C(=O)NC2CCN(Cc3ccccc3)CC2)c1=O
InChI Key InChIKey=AQCCNFXUETZHFK-UHFFFAOYSA-N
Data  2 IC50
  Tab Delimited (TSV)   2D SDfile   Computed 3D by Vconf -m prep SDfile
Find this compound or compounds like it in BindingDB:
Activity Spreadsheet -- Enzyme Inhibition Constant Data from BindingDB
Found 2 hits for monomerid = 50002852
TargetAcetylcholinesterase(Electrophorus electricus (Electric eel))
Universit£
Curated by ChEMBL
LigandPNGBDBM50002852(CHEMBL3233926)
Affinity DataIC50:  1.52E+3nM. Assay description: Inhibition of electric eel AChE using acetylthiocholine iodide as substrate preincubated with enzyme for 10 mins prior to substrate challenge measure...
In DepthDetails ArticlePubMed
TargetCholinesterase(Equus caballus (Horse))
Universit£
Curated by ChEMBL
LigandPNGBDBM50002852(CHEMBL3233926)
Affinity DataIC50: >1.00E+4nM. Assay description: Inhibition of BuChE in equine serum using butyrylthiocholine iodide as substrate preincubated with enzyme for 10 mins prior to substrate challenge me...
In DepthDetails ArticlePubMed