BDBM50002855 CHEMBL3233929
SMILES Oc1c(C(=O)NCC2CCN(Cc3ccccc3)CC2)c(=O)n(Cc2ccccc2)c2ccccc12
InChI Key InChIKey=ZMCIDQXTPIMGHC-UHFFFAOYSA-N
Data  2 IC50
  Tab Delimited (TSV)   2D SDfile   Computed 3D by Vconf -m prep SDfile
Find this compound or compounds like it in BindingDB:
Activity Spreadsheet -- Enzyme Inhibition Constant Data from BindingDB
Found 2 hits for monomerid = 50002855
TargetAcetylcholinesterase(Electrophorus electricus (Electric eel))
Universit£
Curated by ChEMBL
LigandPNGBDBM50002855(CHEMBL3233929)
Affinity DataIC50:  490nM. Assay description: Inhibition of electric eel AChE using acetylthiocholine iodide as substrate preincubated with enzyme for 10 mins prior to substrate challenge measure...
In DepthDetails ArticlePubMed
TargetCholinesterase(Equus caballus (Horse))
Universit£
Curated by ChEMBL
LigandPNGBDBM50002855(CHEMBL3233929)
Affinity DataIC50: >1.00E+4nM. Assay description: Inhibition of BuChE in equine serum using butyrylthiocholine iodide as substrate preincubated with enzyme for 10 mins prior to substrate challenge me...
In DepthDetails ArticlePubMed