BDBM50002987 4-Amino-piperidine-1-carboxylic acid 1-{1-[1-cyclohexylmethyl-2-hydroxy-4-(pyrimidin-2-ylsulfanyl)-butylcarbamoyl]-2-methylsulfanyl-ethylcarbamoyl}-2-phenyl-ethyl ester::CHEMBL116247
SMILES CSC[C@H](NC(=O)[C@H](Cc1ccccc1)OC(=O)N1CCC(N)CC1)C(=O)N[C@@H](CC1CCCCC1)[C@@H](O)CCSc1ncccn1
InChI Key InChIKey=LWOMUKMVKQHDJB-KRCBVYEFSA-N
Data  3 IC50
  Tab Delimited (TSV)   2D SDfile   Computed 3D by Vconf -m prep SDfile
Find this compound or compounds like it in BindingDB:
Activity Spreadsheet -- Enzyme Inhibition Constant Data from BindingDB
Found 3 hits for monomerid = 50002987
TargetRenin(Homo sapiens (Human))
E. Merck Darmstadt
Curated by ChEMBL
LigandPNGBDBM50002987(4-Amino-piperidine-1-carboxylic acid 1-{1-[1-cyclo...)
Affinity DataIC50:  41nMpH: 5.5Assay Description:In vitro inhibitory activity against human plasma renin at pH 5.5 for suppression of angiotensin I formation.
In DepthDetails ArticlePubMed
TargetPepsin A(Porcine)
E. Merck Darmstadt
Curated by ChEMBL
LigandPNGBDBM50002987(4-Amino-piperidine-1-carboxylic acid 1-{1-[1-cyclo...)
Affinity DataIC50: >1.00E+4nM. Assay description: In vitro inhibitory activity was measured on porcine pepsin.
In DepthDetails ArticlePubMed
TargetCathepsin D(Bos taurus)
E. Merck Darmstadt
Curated by ChEMBL
LigandPNGBDBM50002987(4-Amino-piperidine-1-carboxylic acid 1-{1-[1-cyclo...)
Affinity DataIC50: >1.00E+4nM. Assay description: In vitro inhibitory activity was measured on bovine cathepsin D
In DepthDetails ArticlePubMed