BDBM50003030 (2S,4aS,8aR)-1,1,4a-Trimethyl-decahydro-naphthalen-2-ol::1,1,4a-Trimethyl-decahydro-naphthalen-2-ol::CHEMBL308982
SMILES CC1(C)[C@@H](O)CC[C@]2(C)CCCC[C@@H]12
InChI Key InChIKey=KNLXUOXPWXEJME-GVXVVHGQSA-N
Data  2 IC50
  Tab Delimited (TSV)   2D SDfile   Computed 3D by Vconf -m prep SDfile
Find this compound or compounds like it in BindingDB:
Activity Spreadsheet -- Enzyme Inhibition Constant Data from BindingDB
Found 2 hits for monomerid = 50003030
TargetLanosterol synthase(Rattus norvegicus)
Laboratoires Fournier
Curated by ChEMBL
LigandPNGBDBM50003030((2S,4aS,8aR)-1,1,4a-Trimethyl-decahydro-naphthalen...)
Affinity DataIC50: >2.50E+4nM. Assay description: Inhibitory activity against Oxidosqualene-lanosterol cyclase from Rat liver microsomes
In DepthDetails ArticlePubMed
TargetLanosterol synthase(Rattus norvegicus)
Laboratoires Fournier
Curated by ChEMBL
LigandPNGBDBM50003030((2S,4aS,8aR)-1,1,4a-Trimethyl-decahydro-naphthalen...)
Affinity DataIC50:  9.00E+3nM. Assay description: Inhibitory activity against Oxidosqualene-lanosterol cyclase enzyme obtained from rat liver
In DepthDetails ArticlePubMed