BDBM50003133 3-Ethyl-5-methyl-4,5-dihydro-3H-[3,4']bipyridinyl-2,6-dione::CHEMBL124230
SMILES CC[C@@]1(C[C@H](C)C(=O)NC1=O)c1ccncc1
InChI Key InChIKey=LDMYEZUUFHMJSY-TVQRCGJNSA-N
Data  1 IC50
  Tab Delimited (TSV)   2D SDfile   Computed 3D by Vconf -m prep SDfile
Find this compound or compounds like it in BindingDB:
Activity Spreadsheet -- Enzyme Inhibition Constant Data from BindingDB
Found 1 hit for monomerid = 50003133
TargetAromatase(Homo sapiens (Human))
Institute Of Cancer Research
Curated by ChEMBL
LigandPNGBDBM50003133(3-Ethyl-5-methyl-4,5-dihydro-3H-[3,4']bipyridinyl-...)
Affinity DataIC50:  2.30E+4nM. Assay description: Inhibition of Cytochrome P450 19A1
In DepthDetails ArticlePubMed