BDBM50003137 3,5-Dioctyl-4,5-dihydro-3H-[3,4']bipyridinyl-2,6-dione::CHEMBL338746
SMILES CCCCCCCC[C@H]1C[C@@](CCCCCCCC)(C(=O)NC1=O)c1ccncc1
InChI Key InChIKey=QNELUXVQPBSMQH-BKMJKUGQSA-N
Data  1 IC50
  Tab Delimited (TSV)   2D SDfile   Computed 3D by Vconf -m prep SDfile
Find this compound or compounds like it in BindingDB:
Activity Spreadsheet -- Enzyme Inhibition Constant Data from BindingDB
Found 1 hit for monomerid = 50003137
TargetAromatase(Homo sapiens (Human))
Institute Of Cancer Research
Curated by ChEMBL
LigandPNGBDBM50003137(3,5-Dioctyl-4,5-dihydro-3H-[3,4']bipyridinyl-2,6-d...)
Affinity DataIC50:  2.60E+4nM. Assay description: Inhibition of Cytochrome P450 19A1
In DepthDetails ArticlePubMed