BDBM50003166 (diastereomer-1)[1-(6-Cyclohexylmethyl-7-hydroxy-4,8,13-trioxo-1,9-dioxa-5-aza-cyclotridec-3-ylcarbamoyl)-2-phenyl-ethyl]-carbamic acid tert-butyl ester::CHEMBL338764
SMILES CC(C)(C)OC(=O)NC(Cc1ccccc1)C(=O)N[C@H]1COC(=O)CCCOC(=O)[C@H](O)[C@H](CC2CCCCC2)NC1=O
InChI Key InChIKey=QGHUJEGPAPCLTQ-ZUZZFMILSA-N
Data  1 IC50
  Tab Delimited (TSV)   2D SDfile   Computed 3D by Vconf -m prep SDfile
Find this compound or compounds like it in BindingDB:
Activity Spreadsheet -- Enzyme Inhibition Constant Data from BindingDB
Found 1 hit for monomerid = 50003166
TargetRenin(Homo sapiens (Human))
Merck Research Laboratories
Curated by ChEMBL
LigandPNGBDBM50003166((diastereomer-1)[1-(6-Cyclohexylmethyl-7-hydroxy-4...)
Affinity DataIC50:  58nMpH: 7.4Assay Description:Inhibitory activity against human renin inhibition (at pH 7.4)
In DepthDetails ArticlePubMed