BDBM50003189 CHEMBL122919::N-(6-Cyclohexylmethyl-7-hydroxy-10-morpholin-4-ylmethyl-4,8,14-trioxo-1,9-dioxa-5-aza-cyclotetradec-3-yl)-2-phenoxy-acetamide
SMILES O[C@@H]1[C@H](CC2CCCCC2)NC(=O)[C@H](COC(=O)CCC[C@H](CN2CCOCC2)OC1=O)NC(=O)COc1ccccc1
InChI Key InChIKey=PLGNSUDOWASPAQ-DAMQTCOWSA-N
Data  1 IC50
  Tab Delimited (TSV)   2D SDfile   Computed 3D by Vconf -m prep SDfile
Find this compound or compounds like it in BindingDB:
Activity Spreadsheet -- Enzyme Inhibition Constant Data from BindingDB
Found 1 hit for monomerid = 50003189
TargetRenin(Homo sapiens (Human))
Merck Research Laboratories
Curated by ChEMBL
LigandPNGBDBM50003189(CHEMBL122919 | N-(6-Cyclohexylmethyl-7-hydroxy-10-...)
Affinity DataIC50:  61nMpH: 7.4Assay Description:Inhibitory activity against human renin inhibition (at pH 7.4)
In DepthDetails ArticlePubMed