BDBM50003206 CHEMBL338056::N-(1-Carbamoyl-2-phenyl-ethyl)-3-{2-[2-{2-[2-carboxyamino-3-(4-sulfo-phenyl)-propionylamino]-acetylamino}-3-(1H-indol-3-yl)-propionylamino]-4-methylsulfanyl-butyrylamino}-succinamic acid
SMILES CSCC[C@H](NC(=O)[C@H](Cc1c[nH]c2ccccc12)NC(=O)CNC(=O)[C@H](Cc1ccc(cc1)S(O)(=O)=O)NC(O)=O)C(=O)N[C@@H](CC(O)=O)C(=O)N[C@@H](Cc1ccccc1)C(N)=O
InChI Key InChIKey=BJGHLQVSHDFEPC-ZTTXAYQISA-N
Data  2 IC50
  Tab Delimited (TSV)   2D SDfile   Computed 3D by Vconf -m prep SDfile
Find this compound or compounds like it in BindingDB:
Activity Spreadsheet -- Enzyme Inhibition Constant Data from BindingDB
Found 2 hits for monomerid = 50003206
TargetCholecystokinin receptor type A(RAT)
Roche Research Center
Curated by ChEMBL
LigandPNGBDBM50003206(CHEMBL338056 | N-(1-Carbamoyl-2-phenyl-ethyl)-3-{2...)
Affinity DataIC50:  1.20E+3nM. Assay description: The compound was tested in vitro for inhibition of specific [3H]-propanoyl-CCK-8 binding to cholecystokinin type A receptor in rat pancreatic membran...
In DepthDetails ArticlePubMed
TargetGastrin/cholecystokinin type B receptor(Bos taurus)
Roche Research Center
Curated by ChEMBL
LigandPNGBDBM50003206(CHEMBL338056 | N-(1-Carbamoyl-2-phenyl-ethyl)-3-{2...)
Affinity DataIC50:  1.30E+3nM. Assay description: Inhibition of [3H]-propanoyl-CCK-8 binding to Cholecystokinin type B receptor in bovine striatum
In DepthDetails ArticlePubMed