BDBM50003235 2-Methyl-butyric acid 8-[2-(4-hydroxy-6-oxo-tetrahydro-pyran-2-yl)-ethyl]-3,7-dimethyl-1,2,3,7,8,8a-hexahydro-naphthalen-1-yl ester::2-Methyl-butyric acid 8-[2-(4-hydroxy-6-oxo-tetrahydro-pyran-2-yl)-ethyl]-3,7-dimethyl-1,2,3,7,8,8a-hexahydro-naphthalen-1-yl ester: 0.1C4H9Cl::BDBM50226269::CHEMBL333443
SMILES [H][C@](C)(CC)C(=O)O[C@H]1C[C@@H](C)C=C2C=C[C@H](C)[C@H](CC[C@@H]3C[C@@H](O)CC(=O)O3)C12
InChI Key InChIKey=PCZOHLXUXFIOCF-QBVZFDLDSA-N
Data  3 IC50
  Tab Delimited (TSV)   2D SDfile   Computed 3D by Vconf -m prep SDfile
Find this compound or compounds like it in BindingDB:
Activity Spreadsheet -- Enzyme Inhibition Constant Data from BindingDB
Found 3 hits for monomerid = 50003235
Target3-hydroxy-3-methylglutaryl-coenzyme A reductase(Homo sapiens (Human))
Merck Research Laboratories
Curated by ChEMBL
LigandPNGBDBM50003235(2-Methyl-butyric acid 8-[2-(4-hydroxy-6-oxo-tetrah...)
Affinity DataIC50:  18nM. Assay description: The compound was tested in vitro for inhibitory activity against HMG-CoA reductase
In DepthDetails ArticlePubMed
Target3-hydroxy-3-methylglutaryl-coenzyme A reductase(Rattus norvegicus (rat))
TBA
Curated by ChEMBL
LigandPNGBDBM50003235(2-Methyl-butyric acid 8-[2-(4-hydroxy-6-oxo-tetrah...)
Affinity DataIC50:  2.20nM. Assay description: In vitro inhibition of Angiotensin I converting enzyme activity at pH 8.5 in rabbit lung
In DepthDetails ArticlePubMed
Target3-hydroxy-3-methylglutaryl-coenzyme A reductase(Rattus norvegicus (rat))
TBA
Curated by ChEMBL
LigandPNGBDBM50003235(2-Methyl-butyric acid 8-[2-(4-hydroxy-6-oxo-tetrah...)
Affinity DataIC50:  18nM. Assay description: In vitro ability to inhibit solubilized, partially purified, rat liver HMG-CoA reductase
In DepthDetails ArticlePubMed