BDBM50003278 3-[2-Butyl-3-(2-chloro-benzyl)-3H-imidazol-4-yl]-2-(3,4-dichloro-benzyl)-acrylic acid::CHEMBL126521
SMILES CCCCc1ncc(\C=C(/Cc2ccc(Cl)c(Cl)c2)C(O)=O)n1Cc1ccccc1Cl
InChI Key InChIKey=WUNAGXZZIQAIEW-QGOAFFKASA-N
Data  1 IC50
  Tab Delimited (TSV)   2D SDfile   Computed 3D by Vconf -m prep SDfile
Find this compound or compounds like it in BindingDB:
Activity Spreadsheet -- Enzyme Inhibition Constant Data from BindingDB
Found 1 hit for monomerid = 50003278
TargetType-1 angiotensin II receptor B(RAT)
Smithkline Beecham Pharmaceuticals
Curated by ChEMBL
LigandPNGBDBM50003278(3-[2-Butyl-3-(2-chloro-benzyl)-3H-imidazol-4-yl]-2...)
Affinity DataIC50:  2.56E+4nM. Assay description: Inhibition of [125I]-Angiotensin II receptor specific binding to rat mesenteric arteries
In DepthDetails ArticlePubMed