BDBM50003290 CHEMBL39345::[2-Butyl-3-(2-chloro-benzyl)-3H-imidazol-4-yl]-acetic acid
SMILES CCCCc1ncc(CC(O)=O)n1Cc1ccccc1Cl
InChI Key InChIKey=IEZRFVYGWZLAFU-UHFFFAOYSA-N
Data  2 IC50
  Tab Delimited (TSV)   2D SDfile   Computed 3D by Vconf -m prep SDfile
Find this compound or compounds like it in BindingDB:
Activity Spreadsheet -- Enzyme Inhibition Constant Data from BindingDB
Found 2 hits for monomerid = 50003290
TargetType-2 angiotensin II receptor(RAT)
Smithkline Beecham Pharmaceuticals
Curated by ChEMBL
LigandPNGBDBM50003290(CHEMBL39345 | [2-Butyl-3-(2-chloro-benzyl)-3H-imid...)
Affinity DataIC50:  1.20E+4nM. Assay description: In vitro inhibition of [125I]-AII specific binding towards Angiotensin II receptor in rat mesenteric membranes.
In DepthDetails ArticlePubMed
TargetType-1 angiotensin II receptor B(RAT)
Smithkline Beecham Pharmaceuticals
Curated by ChEMBL
LigandPNGBDBM50003290(CHEMBL39345 | [2-Butyl-3-(2-chloro-benzyl)-3H-imid...)
Affinity DataIC50:  1.20E+4nM. Assay description: Compound was evaluated for the inhibition of Angiotensin II receptor induced vasoconstriction of the rabbit aorta
In DepthDetails ArticlePubMed